Merge tag '1.0.4.rc1' into develop

version 1.0.4.rc1
9 jobs for develop in 10 minutes and 42 seconds (queued for 1 second)
Status Job ID Name Coverage
  Build
passed #2926
mac
build:osx

00:02:01

passed #2925
ubuntu14.04
build:trusty

00:02:03

passed #2927
windows
build:windows

00:04:58

 
  Test
failed #2929
mac
test:osx

00:01:17

failed #2928
ubuntu14.04
test:trusty

00:02:24

failed #2930
windows
test:windows

00:03:18

 
  Deploy
skipped #2932
mac
deploy:osx
skipped #2931
ubuntu14.04
deploy:trusty
skipped #2933
windows
deploy:windows
 
Name Stage Failure
failed
test:windows Test There is an unknown failure, please try again
AssertionError: (<class 'MDANSE.Framework.Jobs.IJob.JobError'>, JobError(), <traceback object at 0x0000000007E4CB88>)

----------------------------------------------------------------------
Ran 50 tests in 154.484s

FAILED (failures=1)
One or several unit tests failed
./BuildServer/Windows/run_tests.sh: line 23: exit: status: numeric argument required
ERROR: Build failed: exit status 2
failed
test:osx Test There is an unknown failure, please try again
AssertionError: (<class 'MDANSE.Framework.Jobs.IJob.JobError'>, JobError(), <traceback object at 0x107456cb0>)

----------------------------------------------------------------------
Ran 50 tests in 68.974s

FAILED (failures=1)
One or several functional tests failed
./BuildServer/Darwin/Scripts/run_tests.sh: line 22: exit: status: numeric argument required
ERROR: Build failed: exit status 1
failed
test:trusty Test There is an unknown failure, please try again
AssertionError: (<class 'MDANSE.Framework.Jobs.IJob.JobError'>, JobError(), <traceback object at 0x7f53999aedd0>)

----------------------------------------------------------------------
Ran 50 tests in 138.370s

FAILED (failures=1)
One or several functional tests failed
./BuildServer/Debian/run_tests.sh: line 27: exit: status: numeric argument required
ERROR: Build failed: exit status 1