Correcting tests scripts

6 jobs for feature-remove-old-numeric in 4 minutes and 32 seconds (queued for 1 second)
Status Job ID Name Coverage
  Ci
failed #11809
osx-10.13 sci
ci:osx

00:03:09

failed #11808
ubuntu sci docker
ci:ubuntu_bionic

00:04:00

failed #11806
ubuntu sci docker
ci:ubuntu_trusty

00:03:42

failed #11807
ubuntu sci docker
ci:ubuntu_xenial

00:03:45

failed #11810
windows-10 sci
ci:windows

00:02:59

 
  Clean
passed #11811
ubuntu sci docker
clean_docker

00:00:31

 
Name Stage Failure
failed
ci:ubuntu_bionic Ci
----------------------------------------------------------------------
Ran 66 tests in 17.898s

FAILED (failures=1)
One or several dependencies tests failed
Cleaning repository
Removing intermediate container ee7e6d94a843
The command '/bin/bash -c source ./BuildServer/Unix/definitions_debian.sh ; source ./BuildServer/Unix/version.sh ; ./BuildServer/Unix/tests.sh' returned a non-zero code: 1
ERROR: Job failed: exit code 1
failed
ci:ubuntu_xenial Ci
----------------------------------------------------------------------
Ran 66 tests in 20.806s

FAILED (failures=1)
One or several dependencies tests failed
Cleaning repository
Removing intermediate container 85b9ec409525
The command '/bin/bash -c source ./BuildServer/Unix/definitions_debian.sh ; source ./BuildServer/Unix/version.sh ; ./BuildServer/Unix/tests.sh' returned a non-zero code: 1
ERROR: Job failed: exit code 1
failed
ci:ubuntu_trusty Ci
----------------------------------------------------------------------
Ran 66 tests in 22.228s

FAILED (failures=1)
One or several dependencies tests failed
Cleaning repository
Removing intermediate container a61afc28c41b
The command '/bin/bash -c source ./BuildServer/Unix/definitions_debian.sh ; source ./BuildServer/Unix/version.sh ; ./BuildServer/Unix/tests.sh' returned a non-zero code: 1
ERROR: Job failed: exit code 1
failed
ci:osx Ci
AssertionError: False is not true

----------------------------------------------------------------------
Ran 66 tests in 20.309s

FAILED (failures=1)
One or several dependencies tests failed
Cleaning repository
ERROR: Job failed: exit status 1
failed
ci:windows Ci
AssertionError: False is not true

----------------------------------------------------------------------
Ran 66 tests in 15.384s

FAILED (failures=1)
"Failed when running dependencies tests"
The system cannot find the path specified.
ERROR: Job failed: exit status 1