Updating CrysFML with the new procedure Polynomial_Fit

20 jobs for master in 4 minutes and 22 seconds (queued for 5 seconds)
Status Job ID Name Coverage
  Docker Pre Clean
passed #43091
ubuntu sci docker
docker_pre_clean

00:00:16

 
  Make
passed #43092
ubuntu sci docker
make:linux_gfortran

00:02:32

failed #43094
ubuntu sci docker
make:linux_gfortran_F2008

00:01:58

passed #43093
ubuntu sci docker
make:linux_ifort

00:02:32

failed #43095
ubuntu sci docker
make:linux_ifort_F2008

00:01:59

passed #43096
osx-10.13 sci
make:macos_gfortran

00:01:02

failed #43098
osx-10.13 sci
make:macos_gfortran_F2008

00:00:21

passed #43097
osx-10.13 sci
make:macos_ifort

00:00:59

failed #43099
osx-10.13 sci
make:macos_ifort_F2008

00:00:33

passed #43100
windows-10 sci
make:windows_gfortran

00:00:59

failed #43102
windows-10 sci
make:windows_gfortran_F2008

00:00:35

passed #43101
windows-10 sci
make:windows_ifort

00:01:27

failed #43103
windows-10 sci
make:windows_ifort_F2008

00:00:47

 
  Make Release
skipped #43104
ubuntu sci docker
make_release:linux
skipped #43105
ubuntu sci docker
make_release:linux_F2008
skipped #43106
osx-10.13 sci
make_release:macos
skipped #43107
osx-10.13 sci
make_release:macos_F2008
skipped #43108
windows-10 sci
make_release:windows
skipped #43109
windows-10 sci
make_release:windows_F2008
 
  Docker Post Clean
passed #43110
ubuntu sci docker
docker_post_clean

00:00:14

 
Name Stage Failure
failed
make:windows_ifort_F2008 Make
--------------^
compilation aborted for C:\Users\ci\Gitlab-runner\builds\be101f4f\0\scientific-software\crysfml\Src08\CFML_Maths\Math_PolynomialFit.f90 (code 1)
NMAKE : fatal error U1077: 'C:\PROGRA~2\INTELS~1\COMPIL~1\windows\bin\intel64\ifort.exe' : return code '0x1'
Stop.
NMAKE : fatal error U1077: '"C:\Program Files (x86)\Microsoft Visual Studio\2017\Community\VC\Tools\MSVC\14.16.27023\bin\HostX64\x64\nmake.exe"' : return code '0x2'
Stop.
NMAKE : fatal error U1077: '"C:\Program Files (x86)\Microsoft Visual Studio\2017\Community\VC\Tools\MSVC\14.16.27023\bin\HostX64\x64\nmake.exe"' : return code '0x2'
Stop.
ERROR: Job failed: exit status 2
failed
make:windows_gfortran_F2008 Make
                          1
Error: Expected label 'math_polynomial' for END SUBMODULE statement at (1)
f951.exe: Error: Unexpected end of file in 'C:\Users\ci\Gitlab-runner\builds\be101f4f\0\scientific-software\crysfml\Src08\CFML_Maths\Math_PolynomialFit.f90'
mingw32-make.exe[2]: *** [Src08\CMakeFiles\crysfml.dir\build.make:553: Src08/CMakeFiles/crysfml.dir/CFML_Maths/Math_PolynomialFit.f90.obj] Error 1
mingw32-make.exe[2]: Leaving directory 'C:/Users/ci/Gitlab-runner/builds/be101f4f/0/scientific-software/crysfml/build_gfortran_F2008'
mingw32-make.exe[1]: *** [CMakeFiles\Makefile2:116: Src08/CMakeFiles/crysfml.dir/all] Error 2
mingw32-make.exe[1]: Leaving directory 'C:/Users/ci/Gitlab-runner/builds/be101f4f/0/scientific-software/crysfml/build_gfortran_F2008'
mingw32-make.exe: *** [Makefile:152: all] Error 2
ERROR: Job failed: exit status 2
failed
make:macos_ifort_F2008 Make
cd /Users/ci/builds/90c2e2a3/0/scientific-software/crysfml/build_ifort_F2008/Src08 && /usr/local/bin/ifort   -module crysfml_modules  -g  -c /Users/ci/builds/90c2e2a3/0/scientific-software/crysfml/Src08/CFML_Maths/Math_PolynomialFit.f90 -o CMakeFiles/crysfml.dir/CFML_Maths/Math_PolynomialFit.f90.o
/Users/ci/builds/90c2e2a3/0/scientific-software/crysfml/Src08/CFML_Maths/Math_PolynomialFit.f90(100): error #6785: This name does not match the unit name. [MATH_ZBELONG]
End Submodule Math_Zbelong
--------------^
compilation aborted for /Users/ci/builds/90c2e2a3/0/scientific-software/crysfml/Src08/CFML_Maths/Math_PolynomialFit.f90 (code 1)
make[2]: *** [Src08/CMakeFiles/crysfml.dir/CFML_Maths/Math_PolynomialFit.f90.o] Error 1
make[1]: *** [Src08/CMakeFiles/crysfml.dir/all] Error 2
make: *** [all] Error 2
ERROR: Job failed: exit status 1
failed
make:macos_gfortran_F2008 Make

100 | End Submodule Math_Zbelong
| 1
Error: Expected label 'math_polynomial' for END SUBMODULE statement at (1)
f951: Error: Unexpected end of file in '/Users/ci/builds/90c2e2a3/0/scientific-software/crysfml/Src08/CFML_Maths/Math_PolynomialFit.f90'
make[2]: *** [Src08/CMakeFiles/crysfml.dir/CFML_Maths/Math_PolynomialFit.f90.o] Error 1
make[1]: *** [Src08/CMakeFiles/crysfml.dir/all] Error 2
make: *** [all] Error 2
ERROR: Job failed: exit status 1
failed
make:linux_ifort_F2008 Make
make[2]: *** [Src08/CMakeFiles/crysfml.dir/CFML_Maths/Math_PolynomialFit.f90.o] Error 1
make[1]: *** [Src08/CMakeFiles/crysfml.dir/all] Error 2
make: *** [all] Error 2
Src08/CMakeFiles/crysfml.dir/build.make:552: recipe for target 'Src08/CMakeFiles/crysfml.dir/CFML_Maths/Math_PolynomialFit.f90.o' failed
make[2]: Leaving directory '/app/build_ifort_F2008'
CMakeFiles/Makefile2:115: recipe for target 'Src08/CMakeFiles/crysfml.dir/all' failed
make[1]: Leaving directory '/app/build_ifort_F2008'
Makefile:151: recipe for target 'all' failed
ERROR: Job failed: exit code 2
failed
make:linux_gfortran_F2008 Make
make[2]: *** [Src08/CMakeFiles/crysfml.dir/CFML_Maths/Math_PolynomialFit.f90.o] Error 1
Src08/CMakeFiles/crysfml.dir/build.make:553: recipe for target 'Src08/CMakeFiles/crysfml.dir/CFML_Maths/Math_PolynomialFit.f90.o' failed
make[2]: Leaving directory '/app/build_gfortran_F2008'
CMakeFiles/Makefile2:116: recipe for target 'Src08/CMakeFiles/crysfml.dir/all' failed
make[1]: Leaving directory '/app/build_gfortran_F2008'
make[1]: *** [Src08/CMakeFiles/crysfml.dir/all] Error 2
make: *** [all] Error 2
Makefile:152: recipe for target 'all' failed
ERROR: Job failed: exit code 2