Merge branch 'testing-fpm' of https://code.ill.fr/scientific-software/crysfml into testing-fpm

12 jobs for testing-fpm in 2 minutes and 48 seconds (queued for 6 seconds)
Status Name Job ID Coverage
  Docker Pre Clean
passed docker_pre_clean #58324
docker sci ubuntu

00:00:31

 
  Make
failed make:linux_gfortran #58325
docker sci ubuntu

00:01:47

failed make:linux_ifort #58326
docker sci ubuntu

00:01:47

failed make:macos_gfortran #58327
sci osx-10.13

00:00:32

failed make:macos_ifort #58328
sci osx-10.13

00:00:35

passed make:windows_gfortran #58329
sci windows-10

00:00:04

passed make:windows_ifort #58330
sci windows-10

00:01:17

 
  Make Release
skipped make_release:linux_gfortran #58332
docker sci ubuntu
skipped make_release:linux_ifort #58331
docker sci ubuntu
skipped make_release:macos #58333
sci osx-10.13
skipped make_release:windows #58334
sci windows-10
 
  Docker Post Clean
passed docker_post_clean #58335
docker sci ubuntu

00:00:28

 
Name Stage Failure
failed
make:linux_gfortran Make
Total Test time (real) =   0.17 sec

The following tests FAILED:
1 - calc_powder_Si (Failed)
2 - calc_powder_STO (Failed)
3 - calc_powder_CIF (Failed)
Errors while running CTest
Failure/Error during ctest
ERROR: Job failed: exit code 8
failed
make:linux_ifort Make
Total Test time (real) =   0.16 sec

The following tests FAILED:
1 - calc_powder_Si (Failed)
2 - calc_powder_STO (Failed)
3 - calc_powder_CIF (Failed)
Errors while running CTest
Failure/Error during ctest
ERROR: Job failed: exit code 8
failed
make:macos_ifort Make
Total Test time (real) =   0.23 sec

The following tests FAILED:
1 - calc_powder_Si (Failed)
2 - calc_powder_STO (Failed)
3 - calc_powder_CIF (Failed)
Errors while running CTest
Failure/Error during ctest
ERROR: Job failed: exit status 1
failed
make:macos_gfortran Make
Total Test time (real) =   0.30 sec

The following tests FAILED:
1 - calc_powder_Si (Failed)
2 - calc_powder_STO (Failed)
3 - calc_powder_CIF (Failed)
Errors while running CTest
Failure/Error during ctest
ERROR: Job failed: exit status 1