Merge branch 'dev/prop' of https://code.ill.fr/relaxse/relaxse-code into dev/prop

4 jobs for dev/prop in 24 minutes and 5 seconds (queued for 14 minutes and 48 seconds)
Status Name Job ID Coverage
  Build
failed gnu (debug) #55290
ubuntu

00:04:45

failed gnu-hybrid (debug) #55291
ubuntu

00:05:30

failed ifort (debug) #55288
ubuntu

00:09:11

failed ifort-omp (debug) #55289
ubuntu

00:04:39

 
Name Stage Failure
failed
gnu-hybrid (debug) Build

The following tests FAILED:
20 - CuO_03450 (Failed)
Errors while running CTest
Uploading artifacts...
Runtime platform arch=amd64 os=linux pid=17292 revision=de7731dd version=12.1.0
build/Testing/Temporary/LastTest.log: found 1 matching files

Uploading artifacts to coordinator... ok
id=55291 responseStatus=201 Created token=wGeLusJu
ERROR: Job failed: exit status 1
failed
gnu (debug) Build

The following tests FAILED:
20 - CuO_03450 (Failed)
Errors while running CTest
Uploading artifacts...
Runtime platform arch=amd64 os=linux pid=13600 revision=de7731dd version=12.1.0
build/Testing/Temporary/LastTest.log: found 1 matching files

Uploading artifacts to coordinator... ok
id=55290 responseStatus=201 Created token=EGuszRcx
ERROR: Job failed: exit status 1
failed
ifort-omp (debug) Build

The following tests FAILED:
20 - CuO_03450 (Failed)
Errors while running CTest
Uploading artifacts...
Runtime platform arch=amd64 os=linux pid=10183 revision=de7731dd version=12.1.0
build/Testing/Temporary/LastTest.log: found 1 matching files

Uploading artifacts to coordinator... ok
id=55289 responseStatus=201 Created token=QWTAynis
ERROR: Job failed: exit status 1
failed
ifort (debug) Build

The following tests FAILED:
20 - CuO_03450 (Failed)
Errors while running CTest
Uploading artifacts...
Runtime platform arch=amd64 os=linux pid=4987 revision=de7731dd version=12.1.0
build/Testing/Temporary/LastTest.log: found 1 matching files

Uploading artifacts to coordinator... ok
id=55288 responseStatus=201 Created token=ws24Z-zQ
ERROR: Job failed: exit status 1