erreur ref0 corrigee

4 jobs for dev/prop in 23 minutes and 32 seconds (queued for 13 minutes and 14 seconds)
Status Name Job ID Coverage
  Build
failed gnu (debug) #53008
ubuntu

00:05:28

failed gnu-hybrid (debug) #53009
ubuntu

00:05:36

failed ifort (debug) #53006
ubuntu

00:07:51

failed ifort-omp (debug) #53007
ubuntu

00:04:36

 
Name Stage Failure
failed
gnu-hybrid (debug) Build
The following tests FAILED:
14 - CuO_20240 (Failed)
28 - prop (Failed)
Errors while running CTest
Uploading artifacts...
Runtime platform arch=amd64 os=linux pid=11168 revision=de7731dd version=12.1.0
build/Testing/Temporary/LastTest.log: found 1 matching files

Uploading artifacts to coordinator... ok
id=53009 responseStatus=201 Created token=Ruubn3sV
ERROR: Job failed: exit status 1
failed
gnu (debug) Build
The following tests FAILED:
14 - CuO_20240 (Failed)
28 - prop (Failed)
Errors while running CTest
Uploading artifacts...
Runtime platform arch=amd64 os=linux pid=7355 revision=de7731dd version=12.1.0
build/Testing/Temporary/LastTest.log: found 1 matching files

Uploading artifacts to coordinator... ok
id=53008 responseStatus=201 Created token=AwGuwByx
ERROR: Job failed: exit status 1
failed
ifort-omp (debug) Build
The following tests FAILED:
14 - CuO_20240 (Failed)
28 - prop (Failed)
Errors while running CTest
Uploading artifacts...
Runtime platform arch=amd64 os=linux pid=3831 revision=de7731dd version=12.1.0
build/Testing/Temporary/LastTest.log: found 1 matching files

Uploading artifacts to coordinator... ok
id=53007 responseStatus=201 Created token=gVikZ6xS
ERROR: Job failed: exit status 1
failed
ifort (debug) Build
The following tests FAILED:
14 - CuO_20240 (Failed)
28 - prop (Failed)
Errors while running CTest
Uploading artifacts...
Runtime platform arch=amd64 os=linux pid=30735 revision=de7731dd version=12.1.0
build/Testing/Temporary/LastTest.log: found 1 matching files

Uploading artifacts to coordinator... ok
id=53006 responseStatus=201 Created token=osF4ygeJ
ERROR: Job failed: exit status 1