fermeture des det etc d'elisa

4 jobs for dev/prop in 23 minutes and 47 seconds (queued for 10 seconds)
Status Name Job ID Coverage
  Build
failed gnu (debug) #51519
ubuntu

00:05:30

failed gnu-hybrid (debug) #51520
ubuntu

00:05:47

failed ifort (debug) #51517
ubuntu

00:07:53

failed ifort-omp (debug) #51518
ubuntu

00:04:35

 
Name Stage Failure
failed
gnu-hybrid (debug) Build

The following tests FAILED:
28 - prop (Failed)
Errors while running CTest
Uploading artifacts...
Runtime platform arch=amd64 os=linux pid=20482 revision=de7731dd version=12.1.0
build/Testing/Temporary/LastTest.log: found 1 matching files

Uploading artifacts to coordinator... ok
id=51520 responseStatus=201 Created token=H33fM3R2
ERROR: Job failed: exit status 1
failed
gnu (debug) Build

The following tests FAILED:
28 - prop (Failed)
Errors while running CTest
Uploading artifacts...
Runtime platform arch=amd64 os=linux pid=16645 revision=de7731dd version=12.1.0
build/Testing/Temporary/LastTest.log: found 1 matching files

Uploading artifacts to coordinator... ok
id=51519 responseStatus=201 Created token=SB4QPmqR
ERROR: Job failed: exit status 1
failed
ifort-omp (debug) Build

The following tests FAILED:
28 - prop (Failed)
Errors while running CTest
Uploading artifacts...
Runtime platform arch=amd64 os=linux pid=13139 revision=de7731dd version=12.1.0
build/Testing/Temporary/LastTest.log: found 1 matching files

Uploading artifacts to coordinator... ok
id=51518 responseStatus=201 Created token=wrUDE9yH
ERROR: Job failed: exit status 1
failed
ifort (debug) Build

The following tests FAILED:
28 - prop (Failed)
Errors while running CTest
Uploading artifacts...
Runtime platform arch=amd64 os=linux pid=7813 revision=de7731dd version=12.1.0
build/Testing/Temporary/LastTest.log: found 1 matching files

Uploading artifacts to coordinator... ok
id=51517 responseStatus=201 Created token=fDdPu3te
ERROR: Job failed: exit status 1