test 03405

4 jobs for dev/prop in 23 minutes and 40 seconds (queued for 7 seconds)
Status Name Job ID Coverage
  Build
failed gnu (debug) #51515
ubuntu

00:05:24

failed gnu-hybrid (debug) #51516
ubuntu

00:05:39

failed ifort (debug) #51513
ubuntu

00:08:01

failed ifort-omp (debug) #51514
ubuntu

00:04:35

 
Name Stage Failure
failed
gnu-hybrid (debug) Build

The following tests FAILED:
28 - prop (Failed)
Errors while running CTest
Uploading artifacts...
Runtime platform arch=amd64 os=linux pid=2574 revision=de7731dd version=12.1.0
build/Testing/Temporary/LastTest.log: found 1 matching files

Uploading artifacts to coordinator... ok
id=51516 responseStatus=201 Created token=MXC1LZiy
ERROR: Job failed: exit status 1
failed
gnu (debug) Build

The following tests FAILED:
28 - prop (Failed)
Errors while running CTest
Uploading artifacts...
Runtime platform arch=amd64 os=linux pid=30975 revision=de7731dd version=12.1.0
build/Testing/Temporary/LastTest.log: found 1 matching files

Uploading artifacts to coordinator... ok
id=51515 responseStatus=201 Created token=Z5a8Dc5n
ERROR: Job failed: exit status 1
failed
ifort-omp (debug) Build

The following tests FAILED:
28 - prop (Failed)
Errors while running CTest
Uploading artifacts...
Runtime platform arch=amd64 os=linux pid=27474 revision=de7731dd version=12.1.0
build/Testing/Temporary/LastTest.log: found 1 matching files

Uploading artifacts to coordinator... ok
id=51514 responseStatus=201 Created token=9y4Fss7A
ERROR: Job failed: exit status 1
failed
ifort (debug) Build

The following tests FAILED:
28 - prop (Failed)
Errors while running CTest
Uploading artifacts...
Runtime platform arch=amd64 os=linux pid=21899 revision=de7731dd version=12.1.0
build/Testing/Temporary/LastTest.log: found 1 matching files

Uploading artifacts to coordinator... ok
id=51513 responseStatus=201 Created token=M6yPAgiN
ERROR: Job failed: exit status 1