add some extra comments on type(connect)

4 jobs for dev/prop in 24 minutes and 26 seconds (queued for 1 second)
Status Name Job ID Coverage
  Build
failed gnu (debug) #46568
ubuntu

00:05:34

failed gnu-hybrid (debug) #46569
ubuntu

00:05:38

failed ifort (debug) #46566
ubuntu

00:08:27

failed ifort-omp (debug) #46567
ubuntu

00:04:45

 
Name Stage Failure
failed
gnu-hybrid (debug) Build

The following tests FAILED:
28 - prop (SEGFAULT)
Errors while running CTest
Uploading artifacts...
Runtime platform arch=amd64 os=linux pid=21872 revision=de7731dd version=12.1.0
build/Testing/Temporary/LastTest.log: found 1 matching files

Uploading artifacts to coordinator... ok
id=46569 responseStatus=201 Created token=W6AjsDkW
ERROR: Job failed: exit status 1
failed
ifort-omp (debug) Build

The following tests FAILED:
28 - prop (Failed)
Errors while running CTest
Uploading artifacts...
Runtime platform arch=amd64 os=linux pid=14562 revision=de7731dd version=12.1.0
build/Testing/Temporary/LastTest.log: found 1 matching files

Uploading artifacts to coordinator... ok
id=46567 responseStatus=201 Created token=_s6vMzMd
ERROR: Job failed: exit status 1
failed
gnu (debug) Build

The following tests FAILED:
28 - prop (SEGFAULT)
Errors while running CTest
Uploading artifacts...
Runtime platform arch=amd64 os=linux pid=18048 revision=de7731dd version=12.1.0
build/Testing/Temporary/LastTest.log: found 1 matching files

Uploading artifacts to coordinator... ok
id=46568 responseStatus=201 Created token=nMTmA6zP
ERROR: Job failed: exit status 1
failed
ifort (debug) Build

The following tests FAILED:
28 - prop (Failed)
Errors while running CTest
Uploading artifacts...
Runtime platform arch=amd64 os=linux pid=9228 revision=de7731dd version=12.1.0
build/Testing/Temporary/LastTest.log: found 1 matching files

Uploading artifacts to coordinator... ok
id=46566 responseStatus=201 Created token=yKzbKbew
ERROR: Job failed: exit status 1